Reaction Details
TargetPotassium voltage-gated channel subfamily H member 2
LigandBDBM50274197
Substrate/Competitorn/a
Meas. Tech.ChEMBL_537242 (CHEMBL981857)
IC50>10000±n/a nM
Citation Nagase, TMizutani, TSekino, EIshikawa, SIto, SMitobe, YMiyamoto, YYoshimoto, RTanaka, TIshihara, ATakenaga, NTokita, SSato, N Synthesis and evaluation of structurally constrained quinazolinone derivatives as potent and selective histamine H3 receptor inverse agonists. J Med Chem51:6889-901 (2008) 
 
Potassium voltage-gated channel subfamily H member 2
Name:Potassium voltage-gated channel subfamily H member 2
Type:Multi-pass membrane protein
Mol. Mass.:126672.65
Organism:Homo sapiens (Human)
Description:Q12809
Residue:1159
BDBM50274197
NameBDBM50274197
Synonyms:3-(4-[(1-Cyclobutyl-4-piperidinyl)oxy]phenyl)-2-methylpyrido[4,3-d]pyrimidin-4(3H)-one | CHEMBL484610
TypeSmall organic molecule
Emp. Form.C23H26N4O2
Mol. Mass.390.4781
SMILESCc1nc2ccncc2c(=O)n1-c1ccc(OC2CCN(CC2)C2CCC2)cc1