Reaction Details
TargetHistamine H3 receptor
LigandBDBM50274692
Substrate/Competitorn/a
Meas. Tech.ChEMBL_537264 (CHEMBL982707)
Ki 8.4±n/a nM
Citation Nagase, TMizutani, TSekino, EIshikawa, SIto, SMitobe, YMiyamoto, YYoshimoto, RTanaka, TIshihara, ATakenaga, NTokita, SSato, N Synthesis and evaluation of structurally constrained quinazolinone derivatives as potent and selective histamine H3 receptor inverse agonists. J Med Chem51:6889-901 (2008) 
 
Histamine H3 receptor
Name:Histamine H3 receptor
Type:PROTEIN
Mol. Mass.:48560.37
Organism:Mus musculus
Description:ChEMBL_988451
Residue:445
BDBM50274692
NameBDBM50274692
Synonyms:3-(4-[(1-Cyclobutyl-4-piperidinyl)oxy]phenyl)-5-fluoro-2-methyl-4(3H)-quinazolinone | CHEMBL483400
TypeSmall organic molecule
Emp. Form.C24H26FN3O2
Mol. Mass.407.4805
SMILESCc1nc2cccc(F)c2c(=O)n1-c1ccc(OC2CCN(CC2)C2CCC2)cc1