Reaction Details
TargetB-cell receptor CD22
LigandBDBM50274310
Substrate/Competitorn/a
Meas. Tech.ChEMBL_537287 (CHEMBL985383)
IC50 45000±n/a nM
Citation Abdu-Allah, HHTamanaka, TYu, JZhuoyuan, LSadagopan, MAdachi, TTsubata, TKelm, SIshida, HKiso, M Design, synthesis, and structure-affinity relationships of novel series of sialosides as CD22-specific inhibitors. J Med Chem51:6665-81 (2008) 
 
B-cell receptor CD22
Name:B-cell receptor CD22
Type:PROTEIN
Mol. Mass.:95348.60
Organism:Homo sapiens (Human)
Description:ChEMBL_727026
Residue:847
BDBM50274310
NameBDBM50274310
Synonyms:CHEMBL451045 | p-Methoxyphenyl (3,5,9-trideoxy-9-(4'-trifluromethyl-4-biphenyl)methylamino-5-glycolamido-D-glycero-alpha-D-galacto-2-nonulopyranosylonicacid)-(2->6)-beta-D-galactopyranoside
TypeSmall organic molecule
Emp. Form.C38H45F3N2O15
Mol. Mass.826.7635
SMILESCOc1ccc(O[C@@H]2O[C@H](CO[C@@]3(C[C@H](O)[C@@H](NC(=O)CO)[C@@H](O3)[C@H](O)[C@H](O)CNCc3ccc(cc3)-c3ccc(cc3)C(F)(F)F)C(O)=O)[C@H](O)[C@H](O)[C@H]2O)cc1