Reaction Details
TargetCyclin-dependent kinase 9
LigandBDBM50246465
Substrate/Competitorn/a
Meas. Tech.ChEMBL_557991 (CHEMBL965586)
IC50 770±n/a nM
Citation Fan, JFahr, BStockett, DChan, ECheeti, SSerafimova, ILu, YPham, PWalker, DHHoch, UChoong, IC Modifications of the isonipecotic acid fragment of SNS-032: analogs with improved permeability and lower efflux ratio. Bioorg Med Chem Lett18:6236-9 (2008) 
 
Cyclin-dependent kinase 9
Name:Cyclin-dependent kinase 9
Type:Enzyme Subunit
Mol. Mass.:42789.13
Organism:Homo sapiens (Human)
Description:n/a
Residue:372
BDBM50246465
NameBDBM50246465
Synonyms:(3R,5R)-N-(5-((5-tert-butyloxazol-2-yl)methylthio)thiazol-2-yl)-5-methylpiperidine-3-carboxamide | CHEMBL452601
TypeSmall organic molecule
Emp. Form.C18H26N4O2S2
Mol. Mass.394.555
SMILESC[C@H]1CNC[C@@H](C1)C(=O)Nc1ncc(SCc2ncc(o2)C(C)(C)C)s1