Reaction Details
TargetCyclin-dependent kinase 7
LigandBDBM50246466
Substrate/Competitorn/a
Meas. Tech.ChEMBL_558000 (CHEMBL965595)
IC50 110±n/a nM
Citation Fan, JFahr, BStockett, DChan, ECheeti, SSerafimova, ILu, YPham, PWalker, DHHoch, UChoong, IC Modifications of the isonipecotic acid fragment of SNS-032: analogs with improved permeability and lower efflux ratio. Bioorg Med Chem Lett18:6236-9 (2008) 
 
Cyclin-dependent kinase 7
Name:Cyclin-dependent kinase 7
Type:Enzyme Subunit
Mol. Mass.:39047.01
Organism:Homo sapiens (Human)
Description:n/a
Residue:346
BDBM50246466
NameBDBM50246466
Synonyms:(3R,5S)-N-(5-((5-tert-butyloxazol-2-yl)methylthio)thiazol-2-yl)-5-methylpiperidine-3-carboxamide | CHEMBL452602
TypeSmall organic molecule
Emp. Form.C18H26N4O2S2
Mol. Mass.394.555
SMILESC[C@@H]1CNC[C@@H](C1)C(=O)Nc1ncc(SCc2ncc(o2)C(C)(C)C)s1