Reaction Details
TargetP2Y purinoceptor 1
LigandBDBM50246517
Substrate/Competitorn/a
Meas. Tech.ChEMBL_558003 (CHEMBL965598)
IC50 1300±n/a nM
Citation Morales-Ramos, AIMecom, JSKiesow, TJGraybill, TLBrown, GDAiyar, NVDavenport, EAKallal, LAKnapp-Reed, BALi, PLondregan, ATMorrow, DMSenadhi, SThalji, RKZhao, SBurns-Kurtis, CLMarino, JP Tetrahydro-4-quinolinamines identified as novel P2Y(1) receptor antagonists. Bioorg Med Chem Lett18:6222-6 (2008) 
 
P2Y purinoceptor 1
Name:P2Y purinoceptor 1
Type:Enzyme
Mol. Mass.:42090.25
Organism:Homo sapiens (Human)
Description:P47900
Residue:373
BDBM50246517
NameBDBM50246517
Synonyms:(4-chlorophenyl)((2R,3S,4S)-2-ethyl-3-methyl-4-(phenylamino)-3,4-dihydroquinolin-1(2H)-yl)methanone | CHEMBL461532
TypeSmall organic molecule
Emp. Form.C25H25ClN2O
Mol. Mass.404.932
SMILESCC[C@@H]1[C@@H](C)[C@H](Nc2ccccc2)c2ccccc2N1C(=O)c1ccc(Cl)cc1