Reaction Details
TargetP2Y purinoceptor 1
LigandBDBM50246518
Substrate/Competitorn/a
Meas. Tech.ChEMBL_558004 (CHEMBL965599)
Ki 100±n/a nM
Citation Morales-Ramos, AIMecom, JSKiesow, TJGraybill, TLBrown, GDAiyar, NVDavenport, EAKallal, LAKnapp-Reed, BALi, PLondregan, ATMorrow, DMSenadhi, SThalji, RKZhao, SBurns-Kurtis, CLMarino, JP Tetrahydro-4-quinolinamines identified as novel P2Y(1) receptor antagonists. Bioorg Med Chem Lett18:6222-6 (2008) 
 
P2Y purinoceptor 1
Name:P2Y purinoceptor 1
Type:Enzyme
Mol. Mass.:42090.25
Organism:Homo sapiens (Human)
Description:P47900
Residue:373
BDBM50246518
NameBDBM50246518
Synonyms:((2R,3S,4S)-2-ethyl-3-methyl-4-(phenylamino)-3,4-dihydroquinolin-1(2H)-yl)(4-(trifluoromethoxy)phenyl)methanone | CHEMBL518042
TypeSmall organic molecule
Emp. Form.C26H25F3N2O2
Mol. Mass.454.4841
SMILESCC[C@@H]1[C@@H](C)[C@H](Nc2ccccc2)c2ccccc2N1C(=O)c1ccc(OC(F)(F)F)cc1