Reaction Details
TargetNeuronal acetylcholine receptor subunit alpha-7
LigandBDBM50275878
Substrate/Competitorn/a
Meas. Tech.ChEMBL_492916 (CHEMBL945304)
Ki 4.1±n/a nM
Citation Murineddu, GMurruzzu, CCurzu, MMChelucci, GGotti, CGaimarri, ALegnani, LToma, LPinna, GA Synthesis of 3,6-diazabicyclo[3.1.1]heptanes as novel ligands for neuronal nicotinic acetylcholine receptors. Bioorg Med Chem Lett18:6147-50 (2008) 
 
Neuronal acetylcholine receptor subunit alpha-7
Name:Neuronal acetylcholine receptor subunit alpha-7
Type:Enzyme
Mol. Mass.:56502.44
Organism:Rattus norvegicus (Rat)
Description:Q05941
Residue:502
BDBM50275878
NameBDBM50275878
Synonyms:3-(6-chloropyridin-3-yl)-3,6-diazabicyclo[3.1.1]heptane | CHEMBL462846
TypeSmall organic molecule
Emp. Form.C10H12ClN3
Mol. Mass.209.675
SMILESClc1ccc(cn1)N1CC2CC(C1)N2