Reaction Details
TargetNeuronal acetylcholine receptor subunit alpha-4
LigandBDBM50275933
Substrate/Competitorn/a
Meas. Tech.ChEMBL_492915 (CHEMBL945303)
Ki 0.43±n/a nM
Citation Murineddu, GMurruzzu, CCurzu, MMChelucci, GGotti, CGaimarri, ALegnani, LToma, LPinna, GA Synthesis of 3,6-diazabicyclo[3.1.1]heptanes as novel ligands for neuronal nicotinic acetylcholine receptors. Bioorg Med Chem Lett18:6147-50 (2008) 
 
Neuronal acetylcholine receptor subunit alpha-4
Name:Neuronal acetylcholine receptor subunit alpha-4
Type:Enzyme
Mol. Mass.:70196.44
Organism:Rattus norvegicus (Rat)
Description:P09483
Residue:630
BDBM50275933
NameBDBM50275933
Synonyms:3-(6-chloropyridin-3-yl)-6-methyl-3,6-diazabicyclo[3.1.1]heptane | CHEMBL470573
TypeSmall organic molecule
Emp. Form.C11H14ClN3
Mol. Mass.223.702
SMILESCN1C2CC1CN(C2)c1ccc(Cl)nc1