Reaction Details
TargetNeuronal acetylcholine receptor subunit alpha-7
LigandBDBM50275932
Substrate/Competitorn/a
Meas. Tech.ChEMBL_492916 (CHEMBL945304)
Ki 25±n/a nM
Citation Murineddu, GMurruzzu, CCurzu, MMChelucci, GGotti, CGaimarri, ALegnani, LToma, LPinna, GA Synthesis of 3,6-diazabicyclo[3.1.1]heptanes as novel ligands for neuronal nicotinic acetylcholine receptors. Bioorg Med Chem Lett18:6147-50 (2008) 
 
Neuronal acetylcholine receptor subunit alpha-7
Name:Neuronal acetylcholine receptor subunit alpha-7
Type:Enzyme
Mol. Mass.:56502.44
Organism:Rattus norvegicus (Rat)
Description:Q05941
Residue:502
BDBM50275932
NameBDBM50275932
Synonyms:3-(6-chloropyridazin-3-yl)-3,6-diazabicyclo[3.1.1]heptane | CHEMBL470367
TypeSmall organic molecule
Emp. Form.C9H11ClN4
Mol. Mass.210.663
SMILESClc1ccc(nn1)N1CC2CC(C1)N2