Reaction Details
TargetTyrosine-protein kinase ZAP-70
LigandBDBM50276063
Substrate/Competitorn/a
Meas. Tech.ChEMBL_492925 (CHEMBL945313)
Ki 1551±n/a nM
Citation Farmer, LJBemis, GBritt, SDCochran, JConnors, MHarrington, EMHoock, TMarkland, WNanthakumar, STaslimi, PTer Haar, EWang, JZhaveri, DSalituro, FG Discovery and SAR of novel 4-thiazolyl-2-phenylaminopyrimidines as potent inhibitors of spleen tyrosine kinase (SYK). Bioorg Med Chem Lett18:6231-5 (2008) 
 
Tyrosine-protein kinase ZAP-70
Name:Tyrosine-protein kinase ZAP-70
Type:Enzyme
Mol. Mass.:69881.61
Organism:Homo sapiens (Human)
Description:ZAP-70 SH2 domain was expressed and purified from E. coli using O-phospho-L-tyrosine-agarose column.
Residue:619
BDBM50276063
NameBDBM50276063
Synonyms:4-(thiazol-2-yl)-N-m-tolylpyrimidin-2-amine | CHEMBL471819
TypeSmall organic molecule
Emp. Form.C14H12N4S
Mol. Mass.268.337
SMILESCc1cccc(Nc2nccc(n2)-c2nccs2)c1