Reaction Details
TargetTyrosine-protein kinase ZAP-70
LigandBDBM50276016
Substrate/Competitorn/a
Meas. Tech.ChEMBL_492925 (CHEMBL945313)
Ki 2145±n/a nM
Citation Farmer, LJBemis, GBritt, SDCochran, JConnors, MHarrington, EMHoock, TMarkland, WNanthakumar, STaslimi, PTer Haar, EWang, JZhaveri, DSalituro, FG Discovery and SAR of novel 4-thiazolyl-2-phenylaminopyrimidines as potent inhibitors of spleen tyrosine kinase (SYK). Bioorg Med Chem Lett18:6231-5 (2008) 
 
Tyrosine-protein kinase ZAP-70
Name:Tyrosine-protein kinase ZAP-70
Type:Enzyme
Mol. Mass.:69881.61
Organism:Homo sapiens (Human)
Description:ZAP-70 SH2 domain was expressed and purified from E. coli using O-phospho-L-tyrosine-agarose column.
Residue:619
BDBM50276016
NameBDBM50276016
Synonyms:CHEMBL512319 | N-(3-methoxy-5-(trifluoromethyl)phenyl)-4-(thiazol-2-yl)pyrimidin-2-amine
TypeSmall organic molecule
Emp. Form.C15H11F3N4OS
Mol. Mass.352.334
SMILESCOc1cc(Nc2nccc(n2)-c2nccs2)cc(c1)C(F)(F)F