Reaction Details
TargetTyrosine-protein kinase SYK
LigandBDBM50275357
Substrate/Competitorn/a
Meas. Tech.ChEMBL_492921 (CHEMBL945309)
Ki 23±n/a nM
Citation Farmer, LJBemis, GBritt, SDCochran, JConnors, MHarrington, EMHoock, TMarkland, WNanthakumar, STaslimi, PTer Haar, EWang, JZhaveri, DSalituro, FG Discovery and SAR of novel 4-thiazolyl-2-phenylaminopyrimidines as potent inhibitors of spleen tyrosine kinase (SYK). Bioorg Med Chem Lett18:6231-5 (2008) 
 
Tyrosine-protein kinase SYK
Name:Tyrosine-protein kinase SYK
Type:Enzyme
Mol. Mass.:72079.99
Organism:Homo sapiens (Human)
Description:P43405
Residue:635
BDBM50275357
NameBDBM50275357
Synonyms:CHEMBL451450 | N-(3-methoxy-5-(trifluoromethyl)phenyl)-4-(5-methylthiazol-2-yl)pyrimidin-2-amine
TypeSmall organic molecule
Emp. Form.C16H13F3N4OS
Mol. Mass.366.361
SMILESCOc1cc(Nc2nccc(n2)-c2ncc(C)s2)cc(c1)C(F)(F)F