Reaction Details
TargetTyrosine-protein kinase SYK
LigandBDBM50275355
Substrate/Competitorn/a
Meas. Tech.ChEMBL_492921 (CHEMBL945309)
Ki 33±n/a nM
Citation Farmer, LJBemis, GBritt, SDCochran, JConnors, MHarrington, EMHoock, TMarkland, WNanthakumar, STaslimi, PTer Haar, EWang, JZhaveri, DSalituro, FG Discovery and SAR of novel 4-thiazolyl-2-phenylaminopyrimidines as potent inhibitors of spleen tyrosine kinase (SYK). Bioorg Med Chem Lett18:6231-5 (2008) 
 
Tyrosine-protein kinase SYK
Name:Tyrosine-protein kinase SYK
Type:Enzyme
Mol. Mass.:72079.99
Organism:Homo sapiens (Human)
Description:P43405
Residue:635
BDBM50275355
NameBDBM50275355
Synonyms:(2-(2-(3-methoxy-5-(trifluoromethyl)phenylamino)pyrimidin-4-yl)thiazol-4-yl)methanol | CHEMBL486751
TypeSmall organic molecule
Emp. Form.C16H13F3N4O2S
Mol. Mass.382.36
SMILESCOc1cc(Nc2nccc(n2)-c2nc(CO)cs2)cc(c1)C(F)(F)F