Reaction Details
TargetTyrosine-protein kinase SYK
LigandBDBM50276017
Substrate/Competitorn/a
Meas. Tech.ChEMBL_492926 (CHEMBL945314)
IC50 410±n/a nM
Citation Farmer, LJBemis, GBritt, SDCochran, JConnors, MHarrington, EMHoock, TMarkland, WNanthakumar, STaslimi, PTer Haar, EWang, JZhaveri, DSalituro, FG Discovery and SAR of novel 4-thiazolyl-2-phenylaminopyrimidines as potent inhibitors of spleen tyrosine kinase (SYK). Bioorg Med Chem Lett18:6231-5 (2008) 
 
Tyrosine-protein kinase SYK
Name:Tyrosine-protein kinase SYK
Type:Enzyme
Mol. Mass.:72079.99
Organism:Homo sapiens (Human)
Description:P43405
Residue:635
BDBM50276017
NameBDBM50276017
Synonyms:3-(4-(thiazol-2-yl)pyrimidin-2-ylamino)-5-(trifluoromethyl)phenol | CHEMBL470175
TypeSmall organic molecule
Emp. Form.C14H9F3N4OS
Mol. Mass.338.308
SMILESOc1cc(Nc2nccc(n2)-c2nccs2)cc(c1)C(F)(F)F