Reaction Details
TargetTyrosine-protein kinase SYK
LigandBDBM50249356
Substrate/Competitorn/a
Meas. Tech.ChEMBL_492926 (CHEMBL945314)
IC50 1550±n/a nM
Citation Farmer, LJBemis, GBritt, SDCochran, JConnors, MHarrington, EMHoock, TMarkland, WNanthakumar, STaslimi, PTer Haar, EWang, JZhaveri, DSalituro, FG Discovery and SAR of novel 4-thiazolyl-2-phenylaminopyrimidines as potent inhibitors of spleen tyrosine kinase (SYK). Bioorg Med Chem Lett18:6231-5 (2008) 
 
Tyrosine-protein kinase SYK
Name:Tyrosine-protein kinase SYK
Type:Enzyme
Mol. Mass.:72079.99
Organism:Homo sapiens (Human)
Description:P43405
Residue:635
BDBM50249356
NameBDBM50249356
Synonyms:CHEMBL453217 | N-(3,5-dimethylphenyl)-4-(4-methylthiazol-2-yl)pyrimidin-2-amine
TypeSmall organic molecule
Emp. Form.C16H16N4S
Mol. Mass.296.39
SMILESCc1csc(n1)-c1ccnc(Nc2cc(C)cc(C)c2)n1