Reaction Details
TargetPeroxisome proliferator-activated receptor alpha
LigandBDBM50246088
Substrate/Competitorn/a
Meas. Tech.ChEMBL_558110 (CHEMBL959039)
EC50 90±n/a nM
Citation Martres, PFaucher, NLaroze, APineau, OFouchet, MHPotvain, FGrillot, DBeneton, V The discovery of equipotent PPARalpha/gamma dual activators. Bioorg Med Chem Lett18:6251-4 (2008) 
 
Peroxisome proliferator-activated receptor alpha
Name:Peroxisome proliferator-activated receptor alpha
Type:Enzyme
Mol. Mass.:52222.08
Organism:Homo sapiens (Human)
Description:Q07869
Residue:468
BDBM50246088
NameBDBM50246088
Synonyms:2-methyl-2-[2-methyl-4-({[1-methyl-5-(2'-methyl-biphenyl-4-yl)-1H-pyrazole-3-carbonyl]-amino}-methyl)-phenoxy]-propionic acid | CHEMBL472399
TypeSmall organic molecule
Emp. Form.C30H31N3O4
Mol. Mass.497.5848
SMILESCc1cc(CNC(=O)c2cc(-c3ccc(cc3)-c3ccccc3C)n(C)n2)ccc1OC(C)(C)C(O)=O