Reaction Details
TargetPeroxisome proliferator-activated receptor delta
LigandBDBM50246088
Substrate/Competitorn/a
Meas. Tech.ChEMBL_558114 (CHEMBL959043)
EC50>25000±n/a nM
Citation Martres, PFaucher, NLaroze, APineau, OFouchet, MHPotvain, FGrillot, DBeneton, V The discovery of equipotent PPARalpha/gamma dual activators. Bioorg Med Chem Lett18:6251-4 (2008) 
 
Peroxisome proliferator-activated receptor delta
Name:Peroxisome proliferator-activated receptor delta
Type:PROTEIN
Mol. Mass.:49719.14
Organism:Mus musculus
Description:ChEMBL_1288931
Residue:440
BDBM50246088
NameBDBM50246088
Synonyms:2-methyl-2-[2-methyl-4-({[1-methyl-5-(2'-methyl-biphenyl-4-yl)-1H-pyrazole-3-carbonyl]-amino}-methyl)-phenoxy]-propionic acid | CHEMBL472399
TypeSmall organic molecule
Emp. Form.C30H31N3O4
Mol. Mass.497.5848
SMILESCc1cc(CNC(=O)c2cc(-c3ccc(cc3)-c3ccccc3C)n(C)n2)ccc1OC(C)(C)C(O)=O