Reaction Details
TargetPotassium voltage-gated channel subfamily H member 2
LigandBDBM50275827
Substrate/Competitorn/a
Meas. Tech.ChEMBL_493116 (CHEMBL940379)
Ki 9800±n/a nM
Citation Methot, JLHamblett, CLMampreian, DMJung, JHarsch, ASzewczak, AADahlberg, WKMiddleton, REHughes, BFleming, JCWang, HKral, AMOzerova, NCruz, JCHaines, BChenard, MKenific, CMSecrist, JPMiller, TA SAR profiles of spirocyclic nicotinamide derived selective HDAC1/HDAC2 inhibitors (SHI-1:2). Bioorg Med Chem Lett18:6104-9 (2008) 
 
Potassium voltage-gated channel subfamily H member 2
Name:Potassium voltage-gated channel subfamily H member 2
Type:Multi-pass membrane protein
Mol. Mass.:126672.65
Organism:Homo sapiens (Human)
Description:Q12809
Residue:1159
BDBM50275827
NameBDBM50275827
Synonyms:CHEMBL472252 | N-(2-amino-5-(1-methyl-1H-imidazol-4-yl)phenyl)-6-(2,8-diazaspiro[4.5]decan-8-yl)nicotinamide
TypeSmall organic molecule
Emp. Form.C24H29N7O
Mol. Mass.431.5334
SMILESCn1cnc(c1)-c1ccc(N)c(NC(=O)c2ccc(nc2)N2CCC3(CCNC3)CC2)c1