Reaction Details
TargetPotassium voltage-gated channel subfamily H member 2
LigandBDBM50275942
Substrate/Competitorn/a
Meas. Tech.ChEMBL_493116 (CHEMBL940379)
Ki 3200±n/a nM
Citation Methot, JLHamblett, CLMampreian, DMJung, JHarsch, ASzewczak, AADahlberg, WKMiddleton, REHughes, BFleming, JCWang, HKral, AMOzerova, NCruz, JCHaines, BChenard, MKenific, CMSecrist, JPMiller, TA SAR profiles of spirocyclic nicotinamide derived selective HDAC1/HDAC2 inhibitors (SHI-1:2). Bioorg Med Chem Lett18:6104-9 (2008) 
 
Potassium voltage-gated channel subfamily H member 2
Name:Potassium voltage-gated channel subfamily H member 2
Type:Multi-pass membrane protein
Mol. Mass.:126672.65
Organism:Homo sapiens (Human)
Description:Q12809
Residue:1159
BDBM50275942
NameBDBM50275942
Synonyms:2-(8-(5-(2-amino-5-(thiophen-2-yl)phenylcarbamoyl)pyridin-2-yl)-2,8-diazaspiro[4.5]decan-2-yl)acetic acid | CHEMBL471219
TypeSmall organic molecule
Emp. Form.C26H29N5O3S
Mol. Mass.491.605
SMILESNc1ccc(cc1NC(=O)c1ccc(nc1)N1CCC2(CCN(CC(O)=O)C2)CC1)-c1cccs1