Reaction Details
TargetPotassium voltage-gated channel subfamily H member 2
LigandBDBM50276027
Substrate/Competitorn/a
Meas. Tech.ChEMBL_493116 (CHEMBL940379)
Ki 9420±n/a nM
Citation Methot, JLHamblett, CLMampreian, DMJung, JHarsch, ASzewczak, AADahlberg, WKMiddleton, REHughes, BFleming, JCWang, HKral, AMOzerova, NCruz, JCHaines, BChenard, MKenific, CMSecrist, JPMiller, TA SAR profiles of spirocyclic nicotinamide derived selective HDAC1/HDAC2 inhibitors (SHI-1:2). Bioorg Med Chem Lett18:6104-9 (2008) 
 
Potassium voltage-gated channel subfamily H member 2
Name:Potassium voltage-gated channel subfamily H member 2
Type:Multi-pass membrane protein
Mol. Mass.:126672.65
Organism:Homo sapiens (Human)
Description:Q12809
Residue:1159
BDBM50276027
NameBDBM50276027
Synonyms:CHEMBL470148 | N-(2-amino-5-(thiophen-2-yl)phenyl)-6-(1-hydroxy-8-azaspiro[4.5]decan-8-yl)nicotinamide
TypeSmall organic molecule
Emp. Form.C25H28N4O2S
Mol. Mass.448.58
SMILESNc1ccc(cc1NC(=O)c1ccc(nc1)N1CCC2(CCCC2O)CC1)-c1cccs1