Reaction Details
TargetPotassium voltage-gated channel subfamily H member 2
LigandBDBM50275768
Substrate/Competitorn/a
Meas. Tech.ChEMBL_493116 (CHEMBL940379)
Ki 21450±n/a nM
Citation Methot, JLHamblett, CLMampreian, DMJung, JHarsch, ASzewczak, AADahlberg, WKMiddleton, REHughes, BFleming, JCWang, HKral, AMOzerova, NCruz, JCHaines, BChenard, MKenific, CMSecrist, JPMiller, TA SAR profiles of spirocyclic nicotinamide derived selective HDAC1/HDAC2 inhibitors (SHI-1:2). Bioorg Med Chem Lett18:6104-9 (2008) 
 
Potassium voltage-gated channel subfamily H member 2
Name:Potassium voltage-gated channel subfamily H member 2
Type:Multi-pass membrane protein
Mol. Mass.:126672.65
Organism:Homo sapiens (Human)
Description:Q12809
Residue:1159
BDBM50275768
NameBDBM50275768
Synonyms:CHEMBL499776 | N-(2-aminophenyl)-6-(2,8-diazaspiro[4.5]decan-8-yl)nicotinamide
TypeSmall organic molecule
Emp. Form.C20H25N5O
Mol. Mass.351.4454
SMILESNc1ccccc1NC(=O)c1ccc(nc1)N1CCC2(CCNC2)CC1