Reaction Details
TargetHistone deacetylase 2
LigandBDBM50220232
Substrate/Competitorn/a
Meas. Tech.ChEMBL_493107 (CHEMBL940370)
IC50 308±n/a nM
Citation Methot, JLHamblett, CLMampreian, DMJung, JHarsch, ASzewczak, AADahlberg, WKMiddleton, REHughes, BFleming, JCWang, HKral, AMOzerova, NCruz, JCHaines, BChenard, MKenific, CMSecrist, JPMiller, TA SAR profiles of spirocyclic nicotinamide derived selective HDAC1/HDAC2 inhibitors (SHI-1:2). Bioorg Med Chem Lett18:6104-9 (2008) 
 
Histone deacetylase 2
Name:Histone deacetylase 2
Type:Chromatin regulator; hydrolase; repressor
Mol. Mass.:55356.54
Organism:Homo sapiens (Human)
Description:Q92769
Residue:488
BDBM50220232
NameBDBM50220232
Synonyms:(S)-benzyl 4-(5-((2-aminophenyl)carbamoyl)pyridin-2-yl)-2-methylpiperazine-1-carboxylate CHEMBL236902
TypeSmall organic molecule
Emp. Form.C25H27N5O3
Mol. Mass.445.5136
SMILESC[C@H]1CN(CCN1C(=O)OCc1ccccc1)c1ccc(cn1)C(=O)Nc1ccccc1N