Reaction Details
TargetCannabinoid receptor 1
LigandBDBM50275414
Substrate/Competitorn/a
Meas. Tech.ChEMBL_493369 (CHEMBL940410)
IC50 0.57±n/a nM
Citation Lee, SHSeo, HJLee, SHJung, MEPark, JHPark, HJYoo, JYun, HNa, JKang, SYSong, KSKim, MAChang, CHKim, JLee, J Biarylpyrazolyl oxadiazole as potent, selective, orally bioavailable cannabinoid-1 receptor antagonists for the treatment of obesity. J Med Chem51:7216-33 (2009) 
 
Cannabinoid receptor 1
Name:Cannabinoid receptor 1
Type:G Protein-Coupled Receptor (GPCR)
Mol. Mass.:52856.55
Organism:Rattus norvegicus (rat)
Description:P20272
Residue:473
BDBM50275414
NameBDBM50275414
Synonyms:2-(4-((1H-1,2,4-Triazol-1-yl)methyl)-5-(4-bromophenyl)-1-(2,4-dichlorophenyl)-1H-pyrazol-3-yl)-5-(1-(4-chlorophenyl)cyclopropyl)-1,3,4-oxadiazole | CHEMBL501851
TypeSmall organic molecule
Emp. Form.C29H19BrCl3N7O
Mol. Mass.667.77
SMILESClc1ccc(cc1)C1(CC1)c1nnc(o1)-c1nn(c(c1Cn1cncn1)-c1ccc(Br)cc1)-c1ccc(Cl)cc1Cl