Reaction Details
TargetWee1-like protein kinase
LigandBDBM50245548
Substrate/Competitorn/a
Meas. Tech.ChEMBL_522127 (CHEMBL1006579)
IC50 27±n/a nM
Citation Wichapong, KLindner, MPianwanit, SKokpol, SSippl, W Receptor-based 3D-QSAR studies of checkpoint Wee1 kinase inhibitors. Eur J Med Chem44:1383-95 (2009) 
 
Wee1-like protein kinase
Name:Wee1-like protein kinase
Type:PROTEIN
Mol. Mass.:71599.12
Organism:Homo sapiens (Human)
Description:ChEMBL_1445054
Residue:646
BDBM50245548
NameBDBM50245548
Synonyms:4-(2-Chlorophenyl)-9-hydroxy-6-(3-methoxypropyl)-pyrrolo[3,4-c]carbazole-1,3(2H,6H )-dione CHEMBL488054
TypeSmall organic molecule
Emp. Form.C24H19ClN2O4
Mol. Mass.434.872
SMILESCOCCCn1c2ccc(O)cc2c2c3C(=O)NC(=O)c3c(cc12)-c1ccccc1Cl