Reaction Details
TargetWee1-like protein kinase
LigandBDBM50232232
Substrate/Competitorn/a
Meas. Tech.ChEMBL_522127 (CHEMBL1006579)
IC50 58±n/a nM
Citation Wichapong, KLindner, MPianwanit, SKokpol, SSippl, W Receptor-based 3D-QSAR studies of checkpoint Wee1 kinase inhibitors. Eur J Med Chem44:1383-95 (2009) 
 
Wee1-like protein kinase
Name:Wee1-like protein kinase
Type:PROTEIN
Mol. Mass.:71599.12
Organism:Homo sapiens (Human)
Description:ChEMBL_1445054
Residue:646
BDBM50232232
NameBDBM50232232
Synonyms:4-(2-chlorophenyl)-8-(3-(dimethylamino)propoxy)-9-hydroxy-6-methylpyrrolo[3,4-c]carbazole-1,3(2H,6H)-dione CHEMBL410261
TypeSmall organic molecule
Emp. Form.C26H24ClN3O4
Mol. Mass.477.939
SMILESCN(C)CCCOc1cc2n(C)c3cc(c4C(=O)NC(=O)c4c3c2cc1O)-c1ccccc1Cl