Reaction Details
TargetWee1-like protein kinase
LigandBDBM50232239
Substrate/Competitorn/a
Meas. Tech.ChEMBL_522127 (CHEMBL1006579)
IC50 37±n/a nM
Citation Wichapong, KLindner, MPianwanit, SKokpol, SSippl, W Receptor-based 3D-QSAR studies of checkpoint Wee1 kinase inhibitors. Eur J Med Chem44:1383-95 (2009) 
 
Wee1-like protein kinase
Name:Wee1-like protein kinase
Type:PROTEIN
Mol. Mass.:71599.12
Organism:Homo sapiens (Human)
Description:ChEMBL_1445054
Residue:646
BDBM50232239
NameBDBM50232239
Synonyms:4-(2-chlorophenyl)-9-hydroxy-8-(4-morpholinobutyl)pyrrolo[3,4-c]carbazole-1,3(2H,6H)-dione | CHEMBL403679
TypeSmall organic molecule
Emp. Form.C28H26ClN3O4
Mol. Mass.503.977
SMILESOc1cc2c(cc1CCCCN1CCOCC1)[nH]c1cc(c3C(=O)NC(=O)c3c21)-c1ccccc1Cl