Reaction Details
TargetWee1-like protein kinase
LigandBDBM50279655
Substrate/Competitorn/a
Meas. Tech.ChEMBL_522127 (CHEMBL1006579)
IC50 50±n/a nM
Citation Wichapong, KLindner, MPianwanit, SKokpol, SSippl, W Receptor-based 3D-QSAR studies of checkpoint Wee1 kinase inhibitors. Eur J Med Chem44:1383-95 (2009) 
 
Wee1-like protein kinase
Name:Wee1-like protein kinase
Type:PROTEIN
Mol. Mass.:71599.12
Organism:Homo sapiens (Human)
Description:ChEMBL_1445054
Residue:646
BDBM50279655
NameBDBM50279655
Synonyms:8-(4-(1H-pyrrol-1-yl)butyl)-4-(2-chlorophenyl)-9-hydroxypyrrolo[3,4-c]carbazole-1,3(2H,6H)-dione | CHEMBL518903
TypeSmall organic molecule
Emp. Form.C28H22ClN3O3
Mol. Mass.483.946
SMILESOc1cc2c(cc1CCCCn1cccc1)[nH]c1cc(c3C(=O)NC(=O)c3c21)-c1ccccc1Cl