Reaction Details
TargetWee1-like protein kinase
LigandBDBM50245386
Substrate/Competitorn/a
Meas. Tech.ChEMBL_522127 (CHEMBL1006579)
IC50 12±n/a nM
Citation Wichapong, KLindner, MPianwanit, SKokpol, SSippl, W Receptor-based 3D-QSAR studies of checkpoint Wee1 kinase inhibitors. Eur J Med Chem44:1383-95 (2009) 
 
Wee1-like protein kinase
Name:Wee1-like protein kinase
Type:PROTEIN
Mol. Mass.:71599.12
Organism:Homo sapiens (Human)
Description:ChEMBL_1445054
Residue:646
BDBM50245386
NameBDBM50245386
Synonyms:3-(4-(2-chlorophenyl)-9-hydroxy-1,3-dioxo-2,3-dihydropyrrolo[3,4-c]carbazol-6(1H)-yl)-N-(methylsulfonyl)propanamide N-[3-(4-(2-Chlorophenyl)-9-hydroxy-1,3-dioxo-2,3-dihydropyrrolo[3,4-c]carbazol-6(1H )-yl)-propanoyl]methanesulfonamide
TypeSmall organic molecule
Emp. Form.C24H18ClN3O6S
Mol. Mass.511.934
SMILESCS(=O)(=O)NC(=O)CCn1c2ccc(O)cc2c2c3C(=O)NC(=O)c3c(cc12)-c1ccccc1Cl