Reaction Details
TargetWee1-like protein kinase
LigandBDBM50192412
Substrate/Competitorn/a
Meas. Tech.ChEMBL_522127 (CHEMBL1006579)
IC50 870±n/a nM
Citation Wichapong, KLindner, MPianwanit, SKokpol, SSippl, W Receptor-based 3D-QSAR studies of checkpoint Wee1 kinase inhibitors. Eur J Med Chem44:1383-95 (2009) 
 
Wee1-like protein kinase
Name:Wee1-like protein kinase
Type:PROTEIN
Mol. Mass.:71599.12
Organism:Homo sapiens (Human)
Description:ChEMBL_1445054
Residue:646
BDBM50192412
NameBDBM50192412
Synonyms:9-hydroxy-4-(3-(hydroxymethyl)phenyl)pyrrolo[3,4-c]carbazole-1,3(2H,6H)-dione CHEMBL385349
TypeSmall organic molecule
Emp. Form.C21H14N2O4
Mol. Mass.358.3469
SMILESOCc1cccc(c1)-c1cc2[nH]c3ccc(O)cc3c2c2C(=O)NC(=O)c12