Reaction Details
TargetWee1-like protein kinase
LigandBDBM50192390
Substrate/Competitorn/a
Meas. Tech.ChEMBL_522127 (CHEMBL1006579)
IC50 55±n/a nM
Citation Wichapong, KLindner, MPianwanit, SKokpol, SSippl, W Receptor-based 3D-QSAR studies of checkpoint Wee1 kinase inhibitors. Eur J Med Chem44:1383-95 (2009) 
 
Wee1-like protein kinase
Name:Wee1-like protein kinase
Type:PROTEIN
Mol. Mass.:71599.12
Organism:Homo sapiens (Human)
Description:ChEMBL_1445054
Residue:646
BDBM50192390
NameBDBM50192390
Synonyms:4-(3-chlorophenyl)-9-hydroxypyrrolo[3,4-c]carbazole-1,3(2H,6H)-dione | CHEMBL212495
TypeSmall organic molecule
Emp. Form.C20H11ClN2O3
Mol. Mass.362.766
SMILESOc1ccc2[nH]c3cc(c4C(=O)NC(=O)c4c3c2c1)-c1cccc(Cl)c1