Reaction Details
TargetWee1-like protein kinase
LigandBDBM50192368
Substrate/Competitorn/a
Meas. Tech.ChEMBL_522127 (CHEMBL1006579)
IC50 210±n/a nM
Citation Wichapong, KLindner, MPianwanit, SKokpol, SSippl, W Receptor-based 3D-QSAR studies of checkpoint Wee1 kinase inhibitors. Eur J Med Chem44:1383-95 (2009) 
 
Wee1-like protein kinase
Name:Wee1-like protein kinase
Type:PROTEIN
Mol. Mass.:71599.12
Organism:Homo sapiens (Human)
Description:ChEMBL_1445054
Residue:646
BDBM50192368
NameBDBM50192368
Synonyms:4-(2-aminophenyl)-9-hydroxypyrrolo[3,4-c]carbazole-1,3(2H,6H)-dione CHEMBL378472
TypeSmall organic molecule
Emp. Form.C20H13N3O3
Mol. Mass.343.3355
SMILESNc1ccccc1-c1cc2[nH]c3ccc(O)cc3c2c2C(=O)NC(=O)c12