Reaction Details
TargetWee1-like protein kinase
LigandBDBM50192411
Substrate/Competitorn/a
Meas. Tech.ChEMBL_522127 (CHEMBL1006579)
IC50 58±n/a nM
Citation Wichapong, KLindner, MPianwanit, SKokpol, SSippl, W Receptor-based 3D-QSAR studies of checkpoint Wee1 kinase inhibitors. Eur J Med Chem44:1383-95 (2009) 
 
Wee1-like protein kinase
Name:Wee1-like protein kinase
Type:PROTEIN
Mol. Mass.:71599.12
Organism:Homo sapiens (Human)
Description:ChEMBL_1445054
Residue:646
BDBM50192411
NameBDBM50192411
Synonyms:4-(2-chlorophenyl)-9-hydroxy-6-methylpyrrolo[3,4-c]carbazole-1,3(2H,6H)-dione | CHEMBL209388
TypeSmall organic molecule
Emp. Form.C21H13ClN2O3
Mol. Mass.376.793
SMILESCn1c2ccc(O)cc2c2c3C(=O)NC(=O)c3c(cc12)-c1ccccc1Cl