Reaction Details
TargetWee1-like protein kinase
LigandBDBM50192343
Substrate/Competitorn/a
Meas. Tech.ChEMBL_522127 (CHEMBL1006579)
IC50 430±n/a nM
Citation Wichapong, KLindner, MPianwanit, SKokpol, SSippl, W Receptor-based 3D-QSAR studies of checkpoint Wee1 kinase inhibitors. Eur J Med Chem44:1383-95 (2009) 
 
Wee1-like protein kinase
Name:Wee1-like protein kinase
Type:PROTEIN
Mol. Mass.:71599.12
Organism:Homo sapiens (Human)
Description:ChEMBL_1445054
Residue:646
BDBM50192343
NameBDBM50192343
Synonyms:9-hydroxy-4-phenyl-1H-[1]benzofuro[3,2-e]isoindole-1,3(2H)-dione CHEMBL441695
TypeSmall organic molecule
Emp. Form.C20H11NO4
Mol. Mass.329.3056
SMILESOc1ccc2oc3cc(c4C(=O)NC(=O)c4c3c2c1)-c1ccccc1