Reaction Details
TargetWee1-like protein kinase
LigandBDBM50279557
Substrate/Competitorn/a
Meas. Tech.ChEMBL_522127 (CHEMBL1006579)
IC50 93±n/a nM
Citation Wichapong, KLindner, MPianwanit, SKokpol, SSippl, W Receptor-based 3D-QSAR studies of checkpoint Wee1 kinase inhibitors. Eur J Med Chem44:1383-95 (2009) 
 
Wee1-like protein kinase
Name:Wee1-like protein kinase
Type:PROTEIN
Mol. Mass.:71599.12
Organism:Homo sapiens (Human)
Description:ChEMBL_1445054
Residue:646
BDBM50279557
NameBDBM50279557
Synonyms:9-hydroxy-6-(3-(phenylamino)propyl)pyrrolo[3,4-c]carbazole-1,3(2H,6H)-dione | CHEMBL483800
TypeSmall organic molecule
Emp. Form.C23H19N3O3
Mol. Mass.385.4153
SMILESOc1ccc2n(CCCNc3ccccc3)c3ccc4C(=O)NC(=O)c4c3c2c1