Reaction Details
TargetWee1-like protein kinase
LigandBDBM50279534
Substrate/Competitorn/a
Meas. Tech.ChEMBL_522127 (CHEMBL1006579)
IC50 71±n/a nM
Citation Wichapong, KLindner, MPianwanit, SKokpol, SSippl, W Receptor-based 3D-QSAR studies of checkpoint Wee1 kinase inhibitors. Eur J Med Chem44:1383-95 (2009) 
 
Wee1-like protein kinase
Name:Wee1-like protein kinase
Type:PROTEIN
Mol. Mass.:71599.12
Organism:Homo sapiens (Human)
Description:ChEMBL_1445054
Residue:646
BDBM50279534
NameBDBM50279534
Synonyms:4-(2-chlorophenyl)-9-hydroxy-6-(4-morpholino-4-oxobutyl)pyrrolo[3,4-c]carbazole-1,3(2H,6H)-dione | CHEMBL519212
TypeSmall organic molecule
Emp. Form.C28H24ClN3O5
Mol. Mass.517.96
SMILESOc1ccc2n(CCCC(=O)N3CCOCC3)c3cc(c4C(=O)NC(=O)c4c3c2c1)-c1ccccc1Cl