Reaction Details
TargetWee1-like protein kinase
LigandBDBM50245693
Substrate/Competitorn/a
Meas. Tech.ChEMBL_522127 (CHEMBL1006579)
IC50 110±n/a nM
Citation Wichapong, KLindner, MPianwanit, SKokpol, SSippl, W Receptor-based 3D-QSAR studies of checkpoint Wee1 kinase inhibitors. Eur J Med Chem44:1383-95 (2009) 
 
Wee1-like protein kinase
Name:Wee1-like protein kinase
Type:PROTEIN
Mol. Mass.:71599.12
Organism:Homo sapiens (Human)
Description:ChEMBL_1445054
Residue:646
BDBM50245693
NameBDBM50245693
Synonyms:4-(2,6-dichlorophenyl)-9-hydroxy-6-(3-(methylamino)propyl)pyrrolo[3,4-c]carbazole-1,3(2H,6H)-dione | CHEMBL452336
TypeSmall organic molecule
Emp. Form.C24H19Cl2N3O3
Mol. Mass.468.332
SMILESCNCCCn1c2ccc(O)cc2c2c3C(=O)NC(=O)c3c(cc12)-c1c(Cl)cccc1Cl