Reaction Details
TargetWee1-like protein kinase
LigandBDBM50245547
Substrate/Competitorn/a
Meas. Tech.ChEMBL_522127 (CHEMBL1006579)
IC50 33±n/a nM
Citation Wichapong, KLindner, MPianwanit, SKokpol, SSippl, W Receptor-based 3D-QSAR studies of checkpoint Wee1 kinase inhibitors. Eur J Med Chem44:1383-95 (2009) 
 
Wee1-like protein kinase
Name:Wee1-like protein kinase
Type:PROTEIN
Mol. Mass.:71599.12
Organism:Homo sapiens (Human)
Description:ChEMBL_1445054
Residue:646
BDBM50245547
NameBDBM50245547
Synonyms:4-(4-(2-Chlorophenyl)-9-hydroxy-1,3-dioxo-2,3-dihydropyrrolo[3,4-c]carbazol-6(1H )-yl)butanenitrile CHEMBL520240
TypeSmall organic molecule
Emp. Form.C24H16ClN3O3
Mol. Mass.429.855
SMILESOc1ccc2n(CCCC#N)c3cc(c4C(=O)NC(=O)c4c3c2c1)-c1ccccc1Cl