Reaction Details
TargetActivated CDC42 kinase 1
LigandBDBM50245857
Substrate/Competitorn/a
Meas. Tech.ChEMBL_559411 (CHEMBL1017265)
Ki 18±n/a nM
Citation Kopecky, DJHao, XChen, YFu, JJiao, XJaen, JCCardozo, MGLiu, JWang, ZWalker, NPWesche, HLi, SFarrelly, EXiao, SHKayser, F Identification and optimization of N3,N6-diaryl-1H-pyrazolo[3,4-d]pyrimidine-3,6-diamines as a novel class of ACK1 inhibitors. Bioorg Med Chem Lett18:6352-6 (2008) 
 
Activated CDC42 kinase 1
Name:Activated CDC42 kinase 1
Type:Protein
Mol. Mass.:114577.86
Organism:Homo sapiens (Human)
Description:Q07912
Residue:1038
BDBM50245857
NameBDBM50245857
Synonyms:CHEMBL514919 | N3-(4-fluoro-2,6-dimethylphenyl)-1-(3-methoxy-3-methylbutyl)-N6-(4-(4-methylpiperazin-1-yl)phenyl)-1H-pyrazolo[3,4-d]pyrimidine-3,6-diamine
TypeSmall organic molecule
Emp. Form.C30H39FN8O
Mol. Mass.546.6821
SMILESCOC(C)(C)CCn1nc(Nc2c(C)cc(F)cc2C)c2cnc(Nc3ccc(cc3)N3CCN(C)CC3)nc12