Reaction Details
TargetActivated CDC42 kinase 1
LigandBDBM50245904
Substrate/Competitorn/a
Meas. Tech.ChEMBL_559412 (CHEMBL1017266)
Ki 100±n/a nM
Citation Kopecky, DJHao, XChen, YFu, JJiao, XJaen, JCCardozo, MGLiu, JWang, ZWalker, NPWesche, HLi, SFarrelly, EXiao, SHKayser, F Identification and optimization of N3,N6-diaryl-1H-pyrazolo[3,4-d]pyrimidine-3,6-diamines as a novel class of ACK1 inhibitors. Bioorg Med Chem Lett18:6352-6 (2008) 
 
Activated CDC42 kinase 1
Name:Activated CDC42 kinase 1
Type:Protein
Mol. Mass.:114577.86
Organism:Homo sapiens (Human)
Description:Q07912
Residue:1038
BDBM50245904
NameBDBM50245904
Synonyms:CHEMBL459044 | N-(2,6-dimethylphenyl)-4-(2-ethoxyphenoxy)-2-(4-(piperazin-1-yl)phenylamino)pyrimidine-5-carboxamide
TypeSmall organic molecule
Emp. Form.C31H34N6O3
Mol. Mass.538.6401
SMILESCCOc1ccccc1Oc1nc(Nc2ccc(cc2)N2CCNCC2)ncc1C(=O)Nc1c(C)cccc1C