Reaction Details
TargetActivated CDC42 kinase 1
LigandBDBM50246162
Substrate/Competitorn/a
Meas. Tech.ChEMBL_559412 (CHEMBL1017266)
Ki 10±n/a nM
Citation Kopecky, DJHao, XChen, YFu, JJiao, XJaen, JCCardozo, MGLiu, JWang, ZWalker, NPWesche, HLi, SFarrelly, EXiao, SHKayser, F Identification and optimization of N3,N6-diaryl-1H-pyrazolo[3,4-d]pyrimidine-3,6-diamines as a novel class of ACK1 inhibitors. Bioorg Med Chem Lett18:6352-6 (2008) 
 
Activated CDC42 kinase 1
Name:Activated CDC42 kinase 1
Type:Protein
Mol. Mass.:114577.86
Organism:Homo sapiens (Human)
Description:Q07912
Residue:1038
BDBM50246162
NameBDBM50246162
Synonyms:CHEMBL472392 N~3~-(2,6-dimethylphenyl)-1-(3-methoxy-3-methylbutyl)-N~6~-(4-piperazin-1-ylphenyl)-1H-pyrazolo[3,4-d]pyrimidine-3,6-diamine
TypeSmall organic molecule
Emp. Form.C29H38N8O
Mol. Mass.514.665
SMILESCOC(C)(C)CCn1nc(Nc2c(C)cccc2C)c2cnc(Nc3ccc(cc3)N3CCNCC3)nc12