Reaction Details
TargetActivated CDC42 kinase 1
LigandBDBM50246213
Substrate/Competitorn/a
Meas. Tech.ChEMBL_559412 (CHEMBL1017266)
Ki 10±n/a nM
Citation Kopecky, DJHao, XChen, YFu, JJiao, XJaen, JCCardozo, MGLiu, JWang, ZWalker, NPWesche, HLi, SFarrelly, EXiao, SHKayser, F Identification and optimization of N3,N6-diaryl-1H-pyrazolo[3,4-d]pyrimidine-3,6-diamines as a novel class of ACK1 inhibitors. Bioorg Med Chem Lett18:6352-6 (2008) 
 
Activated CDC42 kinase 1
Name:Activated CDC42 kinase 1
Type:Protein
Mol. Mass.:114577.86
Organism:Homo sapiens (Human)
Description:Q07912
Residue:1038
BDBM50246213
NameBDBM50246213
Synonyms:CHEMBL487896 | N3-(2,6-dichlorophenyl)-1-(3-methoxy-3-methylbutyl)-N6-(4-(piperazin-1-yl)phenyl)-1H-pyrazolo[3,4-d]pyrimidine-3,6-diamine
TypeSmall organic molecule
Emp. Form.C27H32Cl2N8O
Mol. Mass.555.502
SMILESCOC(C)(C)CCn1nc(Nc2c(Cl)cccc2Cl)c2cnc(Nc3ccc(cc3)N3CCNCC3)nc12