Reaction Details
TargetActivated CDC42 kinase 1
LigandBDBM50245908
Substrate/Competitorn/a
Meas. Tech.ChEMBL_559412 (CHEMBL1017266)
Ki 70±n/a nM
Citation Kopecky, DJHao, XChen, YFu, JJiao, XJaen, JCCardozo, MGLiu, JWang, ZWalker, NPWesche, HLi, SFarrelly, EXiao, SHKayser, F Identification and optimization of N3,N6-diaryl-1H-pyrazolo[3,4-d]pyrimidine-3,6-diamines as a novel class of ACK1 inhibitors. Bioorg Med Chem Lett18:6352-6 (2008) 
 
Activated CDC42 kinase 1
Name:Activated CDC42 kinase 1
Type:Protein
Mol. Mass.:114577.86
Organism:Homo sapiens (Human)
Description:Q07912
Residue:1038
BDBM50245908
NameBDBM50245908
Synonyms:CHEMBL518822 | N3-(2,6-dimethylphenyl)-1-(2-morpholinoethyl)-N6-phenyl-1H-pyrazolo[3,4-d]pyrimidine-3,6-diamine
TypeSmall organic molecule
Emp. Form.C25H29N7O
Mol. Mass.443.5441
SMILESCc1cccc(C)c1Nc1nn(CCN2CCOCC2)c2nc(Nc3ccccc3)ncc12