Reaction Details
TargetCyclin-dependent kinase 1
LigandBDBM50245866
Substrate/Competitorn/a
Meas. Tech.ChEMBL_559443 (CHEMBL1018124)
IC50 11±n/a nM
Citation Jones, CDAndrews, DMBarker, AJBlades, KDaunt, PEast, SGeh, CGraham, MAJohnson, KMLoddick, SAMcFarland, HMMcGregor, AMoss, LRudge, DASimpson, PBSwain, MLTam, KYTucker, JAWalker, M The discovery of AZD5597, a potent imidazole pyrimidine amide CDK inhibitor suitable for intravenous dosing. Bioorg Med Chem Lett18:6369-73 (2008) 
 
Cyclin-dependent kinase 1
Name:Cyclin-dependent kinase 1
Type:Enzyme Subunit
Mol. Mass.:34101.08
Organism:Homo sapiens (Human)
Description:P06493
Residue:297
BDBM50245866
NameBDBM50245866
Synonyms:((R)-3-(dimethylamino)pyrrolidin-1-yl)(4-(5-fluoro-4-(1-isopropyl-2-methyl-1H-imidazol-5-yl)pyrimidin-2-ylamino)phenyl)methanone | CHEMBL460103
TypeSmall organic molecule
Emp. Form.C24H30FN7O
Mol. Mass.451.5397
SMILESCC(C)n1c(C)ncc1-c1nc(Nc2ccc(cc2)C(=O)N2CC[C@H](C2)N(C)C)ncc1F