Reaction Details
TargetCyclin-dependent kinase 2
LigandBDBM50246405
Substrate/Competitorn/a
Meas. Tech.ChEMBL_559442 (CHEMBL1018123)
IC50 11±n/a nM
Citation Jones, CDAndrews, DMBarker, AJBlades, KDaunt, PEast, SGeh, CGraham, MAJohnson, KMLoddick, SAMcFarland, HMMcGregor, AMoss, LRudge, DASimpson, PBSwain, MLTam, KYTucker, JAWalker, M The discovery of AZD5597, a potent imidazole pyrimidine amide CDK inhibitor suitable for intravenous dosing. Bioorg Med Chem Lett18:6369-73 (2008) 
 
Cyclin-dependent kinase 2
Name:Cyclin-dependent kinase 2
Type:Enzyme Subunit
Mol. Mass.:33938.17
Organism:Homo sapiens (Human)
Description:P24941
Residue:298
BDBM50246405
NameBDBM50246405
Synonyms:2-fluoro-4-(4-(1-isopropyl-2-methyl-1H-imidazol-5-yl)pyrimidin-2-ylamino)-N-(1-methylpiperidin-4-yl)benzamide | CHEMBL453895
TypeSmall organic molecule
Emp. Form.C24H30FN7O
Mol. Mass.451.5397
SMILESCC(C)n1c(C)ncc1-c1ccnc(Nc2ccc(C(=O)NC3CCN(C)CC3)c(F)c2)n1