Reaction Details
TargetCyclin-dependent kinase 1
LigandBDBM50246253
Substrate/Competitorn/a
Meas. Tech.ChEMBL_559443 (CHEMBL1018124)
IC50 62±n/a nM
Citation Jones, CDAndrews, DMBarker, AJBlades, KDaunt, PEast, SGeh, CGraham, MAJohnson, KMLoddick, SAMcFarland, HMMcGregor, AMoss, LRudge, DASimpson, PBSwain, MLTam, KYTucker, JAWalker, M The discovery of AZD5597, a potent imidazole pyrimidine amide CDK inhibitor suitable for intravenous dosing. Bioorg Med Chem Lett18:6369-73 (2008) 
 
Cyclin-dependent kinase 1
Name:Cyclin-dependent kinase 1
Type:Enzyme Subunit
Mol. Mass.:34101.08
Organism:Homo sapiens (Human)
Description:P06493
Residue:297
BDBM50246253
NameBDBM50246253
Synonyms:4-(1-isopropyl-2-methyl-1H-imidazol-5-yl)-N-(4-(methylsulfonyl)phenyl)pyrimidin-2-amine CHEMBL488436
TypeSmall organic molecule
Emp. Form.C18H21N5O2S
Mol. Mass.371.457
SMILESCC(C)n1c(C)ncc1-c1ccnc(Nc2ccc(cc2)S(C)(=O)=O)n1