Reaction Details
TargetC-C chemokine receptor type 3
LigandBDBM50255038
Substrate/Competitorn/a
Meas. Tech.ChEMBL_560250 (CHEMBL1019589)
IC50 2.1±n/a nM
Citation Dhar, TGYang, GDavies, PMalley, MFGougoutas, JZWu, DRBarrish, JCCarter, PH Urea based CCR3 antagonists employing a tetrahydro-1,3-oxazin-2-one spacer. Bioorg Med Chem Lett19:96-9 (2008) 
 
C-C chemokine receptor type 3
Name:C-C chemokine receptor type 3
Type:Enzyme
Mol. Mass.:41053.88
Organism:Homo sapiens (Human)
Description:P51677
Residue:355
BDBM50255038
NameBDBM50255038
Synonyms:1-((5R,6S)-6-((cyclopropyl(3-(4-fluorophenyl)propyl)amino)methyl)-3-methyl-2-oxo-1,3-oxazinan-5-yl)-3-(3-(1-methyl-1H-tetrazol-5-yl)phenyl)urea | CHEMBL465942
TypeSmall organic molecule
Emp. Form.C27H33FN8O3
Mol. Mass.536.6011
SMILESCN1C[C@@H](NC(=O)Nc2cccc(c2)-c2nnnn2C)[C@H](CN(CCCc2ccc(F)cc2)C2CC2)OC1=O