Reaction Details
TargetC-C chemokine receptor type 3
LigandBDBM50209984
Substrate/Competitorn/a
Meas. Tech.ChEMBL_560250 (CHEMBL1019589)
IC50 1.2±n/a nM
Citation Dhar, TGYang, GDavies, PMalley, MFGougoutas, JZWu, DRBarrish, JCCarter, PH Urea based CCR3 antagonists employing a tetrahydro-1,3-oxazin-2-one spacer. Bioorg Med Chem Lett19:96-9 (2008) 
 
C-C chemokine receptor type 3
Name:C-C chemokine receptor type 3
Type:Enzyme
Mol. Mass.:41053.88
Organism:Homo sapiens (Human)
Description:P51677
Residue:355
BDBM50209984
NameBDBM50209984
Synonyms:1-((3S,4S)-4-(((S)-3-(4-fluorobenzyl)piperidin-1-yl)methyl)-1-methylpiperidin-3-yl)-3-(5-acetyl-4-methylthiazol-2-yl)urea CHEMBL410959
TypeSmall organic molecule
Emp. Form.C26H36FN5O2S
Mol. Mass.501.66
SMILESCN1CC[C@@H](CN2CCC[C@@H](Cc3ccc(F)cc3)C2)[C@@H](C1)NC(=O)Nc1nc(C)c(s1)C(C)=O