Reaction Details
TargetC-C chemokine receptor type 3
LigandBDBM50255006
Substrate/Competitorn/a
Meas. Tech.ChEMBL_560250 (CHEMBL1019589)
IC50 0.23±n/a nM
Citation Dhar, TGYang, GDavies, PMalley, MFGougoutas, JZWu, DRBarrish, JCCarter, PH Urea based CCR3 antagonists employing a tetrahydro-1,3-oxazin-2-one spacer. Bioorg Med Chem Lett19:96-9 (2008) 
 
C-C chemokine receptor type 3
Name:C-C chemokine receptor type 3
Type:Enzyme
Mol. Mass.:41053.88
Organism:Homo sapiens (Human)
Description:P51677
Residue:355
BDBM50255006
NameBDBM50255006
Synonyms:1-((5R,6S)-6-(((S)-3-(4-fluorobenzyl)piperidin-1-yl)methyl)-3-methyl-2-oxo-1,3-oxazinan-5-yl)-3-(3-(1-methyl-1H-tetrazol-5-yl)phenyl)urea | CHEMBL464902
TypeSmall organic molecule
Emp. Form.C27H33FN8O3
Mol. Mass.536.6011
SMILESCN1C[C@@H](NC(=O)Nc2cccc(c2)-c2nnnn2C)[C@H](CN2CCC[C@@H](Cc3ccc(F)cc3)C2)OC1=O