Reaction Details
TargetC-C chemokine receptor type 3
LigandBDBM50254448
Substrate/Competitorn/a
Meas. Tech.ChEMBL_560250 (CHEMBL1019589)
IC50 0.470±n/a nM
Citation Dhar, TGYang, GDavies, PMalley, MFGougoutas, JZWu, DRBarrish, JCCarter, PH Urea based CCR3 antagonists employing a tetrahydro-1,3-oxazin-2-one spacer. Bioorg Med Chem Lett19:96-9 (2008) 
 
C-C chemokine receptor type 3
Name:C-C chemokine receptor type 3
Type:Enzyme
Mol. Mass.:41053.88
Organism:Homo sapiens (Human)
Description:P51677
Residue:355
BDBM50254448
NameBDBM50254448
Synonyms:1-(6-((ethyl(3-(4-fluorophenyl) propyl)amino)methyl)-3,5-dimethyl-2-oxo-1,3-oxazinan-5-yl)-3-(3-(1-methyl-1H-tetrazol-5-yl)phenyl)urea CHEMBL461445
TypeSmall organic molecule
Emp. Form.C27H35FN8O3
Mol. Mass.538.617
SMILESCCN(CCCc1ccc(F)cc1)CC1OC(=O)N(C)CC1(C)NC(=O)Nc1cccc(c1)-c1nnnn1C